[tproxy] Kernel compilation error

Tomasz Wrona Tomasz Wrona <twr@wp.pl>
Mon, 1 Sep 2003 20:47:39 +0200


I upgraded 2.4.21 kernel with latest tproxy patch but compilation process
returns follownig error:

ip_nat_h323.c: In function `h225_nat_expected':
ip_nat_h323.c:135: too few arguments to function `ip_nat_setup_info_R4b726ec1'
make[2]: *** [ip_nat_h323.o] Error 1
make[2]: Leaving directory `/home/src/linux-2.4.21/net/ipv4/netfilter'
make[1]: *** [_modsubdir_ipv4/netfilter] Error 2
make[1]: Leaving directory `/home/src/linux-2.4.21/net'
make: *** [_mod_net] Error 2

In configure I removed from options to compile h323 module but error
appeared in other module, also remover but error still appears...

What it can be ?